{"text_format":"1","workbook":"xlsx","n_sheets":4,"sheets":["INFO_Advising_Sheet","Scales","CourseOptions","Additional Items to Consider"],"not_rendered":{"charts":0,"images":5,"macros":1,"external_links":0,"defined_names":2,"comments":0,"pivot_tables":0},"unopened":[],"bounds":{"document_bytes":16777216,"sheet_cells":100000,"rows_first":2000,"rows_last":500,"rows_between":2000,"halvings":0,"cell_chars":16384,"cell_head_chars":4096},"cells_cut":0,"cells_raw":0,"read":"whole","date_system":"1900"}

{"sheet":"INFO_Advising_Sheet","index":0,"n_rows":110,"n_cols":15,"rows_kept":110,"cut":false,"hidden":false,"merged":[[4,14,6,21],[107,0,107,10],[28,0,28,10],[109,0,109,10],[45,0,45,10],[36,0,36,10],[38,0,38,10],[63,0,63,10],[83,3,83,10],[92,3,92,10],[49,0,49,10],[73,0,73,10],[70,0,70,10],[80,0,80,10],[59,0,59,10],[54,0,54,10],[50,0,50,10],[55,0,55,10],[37,0,37,10],[20,0,20,10],[5,7,7,10],[4,0,4,1],[5,0,5,1],[6,0,6,1],[6,2,6,6],[4,2,4,6],[5,2,5,6],[4,7,4,10],[7,0,7,1],[7,2,7,6]]}
[null,null,null,null,null,"BACHELOR of ARTS in IIMA"]
[null,null,null,null,null,"For students who entered the Program starting Fall 2020 or after"]
[null,null,null,null,null,"Total Credits Required:  120"]
[null,null,null,null,null,"Last Revised: 11/2021"]
["NAME:",null,null,null,null,null,null,"Notes:",null,null,null,null,null,null,"Note: My advising sheets are based on the latest degree requirements. As a student you have the option to graduate based your matriculation date to the university.  My recommendation is to always pick the latest degree requirements."]
["ID#: "]
["DATE: "]
["Transfer Credits:"]
[]
["FUNDAMENTAL LITERACIES: (13 - 19 credits)",null,null,null,null,null,null,null,null,null,null,null,null,null,"You can find your matriculation date (bulletin) using AAR.  For example:"]
["https://academics.iusb.edu/general-education/fundamental-literacies.html"]
[null,"Course No.","Title","Credit","Grade","Semester","Year","Notes:","Hrs Passed","GPA Hrs","GPA"]
["A","ENG-W 131","English Composition ",3,null,null,null,"A grade of C or better is required.",{"$f":"IF(OR(E13= \"A+\",E13=\"A\", E13=\"A-\",E13=\"B+\", E13=\"B\", E13=\"B-\", E13=\"C+\", E13=\"C\", E13=\"C-\", E13=\"D+\", E13=\"D\", E13=\"D-\", E13=\"S\"), D13, 0)","v":0},{"$f":"IF(OR(E13= \"A+\",E13=\"A\", E13=\"A-\",E13=\"B+\", E13=\"B\", E13=\"B-\", E13=\"C+\", E13=\"C\", E13=\"C-\", E13=\"D+\", E13=\"D\", E13=\"D-\", E13=\"F\"), D13, 0)","v":0},{"$f":"IF(ISBLANK(E13 ),\"\",IF( VLOOKUP(E13,Scales!$C$3:$D$19,2,FALSE) <0, \"\", D13*VLOOKUP(E13,Scales!$C$3:$D$19,2,FALSE)))","v":""}]
["B","PHIL-P 110","Critical Thinking",3,null,null,null,"e.g., CSCI-C250, PHIL- P 105, P 110, P 150",{"$f":"IF(OR(E14= \"A+\",E14=\"A\", E14=\"A-\",E14=\"B+\", E14=\"B\", E14=\"B-\", E14=\"C+\", E14=\"C\", E14=\"C-\", E14=\"D+\", E14=\"D\", E14=\"D-\", E14=\"S\"), D14, 0)","v":0},{"$f":"IF(OR(E14= \"A+\",E14=\"A\", E14=\"A-\",E14=\"B+\", E14=\"B\", E14=\"B-\", E14=\"C+\", E14=\"C\", E14=\"C-\", E14=\"D+\", E14=\"D\", E14=\"D-\", E14=\"F\"), D14, 0)","v":0},{"$f":"IF(ISBLANK(E14 ),\"\",IF( VLOOKUP(E14,Scales!$C$3:$D$19,2,FALSE) <0, \"\", D14*VLOOKUP(E14,Scales!$C$3:$D$19,2,FALSE)))","v":""}]
["C","SPCH-S 121","Oral Communication",3,null,null,null,"SPCH-S 121",0,0,{"$f":"IF(ISBLANK(E15 ),\"\",IF( VLOOKUP(E15,Scales!$C$3:$D$19,2,FALSE) <0, \"\", D15*VLOOKUP(E15,Scales!$C$3:$D$19,2,FALSE)))","v":""}]
["D","INFO-I 310","Visual  Literary",0,"ok",null,null,"e.g., INFO-I310, FINA A109, JOUR J210",0,0,{"$f":"IF(ISBLANK(E16 ),\"\",IF( VLOOKUP(E16,Scales!$C$3:$D$19,2,FALSE) <0, \"\", D16*VLOOKUP(E16,Scales!$C$3:$D$19,2,FALSE)))","v":{"$error":"#N/A"}}]
["E","MATH-M 118","Quantitative Reasoning",0,"ok",null,null,"Satisfied by required Mathematics courses",0,0,{"$f":"IF(ISBLANK(E17 ),\"\",IF( VLOOKUP(E17,Scales!$C$3:$D$19,2,FALSE) <0, \"\", D17*VLOOKUP(E17,Scales!$C$3:$D$19,2,FALSE)))","v":{"$error":"#N/A"}}]
["F","COAS-Q 110","Information Literacy",1,null,null,null,"Should be taken with ENG W131",0,0,{"$f":"IF(ISBLANK(E18 ),\"\",IF( VLOOKUP(E18,Scales!$C$3:$D$19,2,FALSE) <0, \"\", D18*VLOOKUP(E18,Scales!$C$3:$D$19,2,FALSE)))","v":""}]
["G","INFO-I 101","Computer Literacy",0,"ok",null,null,"Satisfied by required Informatics courses",0,0,{"$f":"IF(ISBLANK(E19 ),\"\",IF( VLOOKUP(E19,Scales!$C$3:$D$19,2,FALSE) <0, \"\", D19*VLOOKUP(E19,Scales!$C$3:$D$19,2,FALSE)))","v":{"$error":"#N/A"}}]
[]
["COMMON CORE (12 Credits) At least one of the following must be at the 300 level."]
["https://academics.iusb.edu/general-education/common-core.html "]
[null,"Course No.","Title","Credit","Grade","Semester","Year","Notes:","Hrs Passed","GPA Hrs","GPA"]
["A","N190","The Natural World",3,null,null,null,"N190 or N390 (BIOL, CHEM, GEOL, PHYS, ASTR, etc.)",{"$f":"IF(OR(E24= \"A+\",E24=\"A\", E24=\"A-\",E24=\"B+\", E24=\"B\", E24=\"B-\", E24=\"C+\", E24=\"C\", E24=\"C-\", E24=\"D+\", E24=\"D\", E24=\"D-\", E24=\"S\"), D24, 0)","v":0},{"$f":"IF(OR(E24= \"A+\",E24=\"A\", E24=\"A-\",E24=\"B+\", E24=\"B\", E24=\"B-\", E24=\"C+\", E24=\"C\", E24=\"C-\", E24=\"D+\", E24=\"D\", E24=\"D-\", E24=\"F\"), D24, 0)","v":0},{"$f":"IF(ISBLANK(E24 ),\"\",IF( VLOOKUP(E24,Scales!$C$3:$D$19,2,FALSE) <0, \"\", D24*VLOOKUP(E24,Scales!$C$3:$D$19,2,FALSE)))","v":""}]
["B","B190","Human Behavior & Social Institutions",3,null,null,null,"B190 or B399 (COGS, POLS, PSY, SOC, etc.)",{"$f":"IF(OR(E25= \"A+\",E25=\"A\", E25=\"A-\",E25=\"B+\", E25=\"B\", E25=\"B-\", E25=\"C+\", E25=\"C\", E25=\"C-\", E25=\"D+\", E25=\"D\", E25=\"D-\", E25=\"S\"), D25, 0)","v":0},{"$f":"IF(OR(E25= \"A+\",E25=\"A\", E25=\"A-\",E25=\"B+\", E25=\"B\", E25=\"B-\", E25=\"C+\", E25=\"C\", E25=\"C-\", E25=\"D+\", E25=\"D\", E25=\"D-\", E25=\"F\"), D25, 0)","v":0},{"$f":"IF(ISBLANK(E25 ),\"\",IF( VLOOKUP(E25,Scales!$C$3:$D$19,2,FALSE) <0, \"\", D25*VLOOKUP(E25,Scales!$C$3:$D$19,2,FALSE)))","v":""}]
["C","T190","Literary and Intellectual Traditions",3,null,null,null,"T190 or T390 (CMLT, ENG, FINA, HIST, PHIL, MUS, etc.)",0,0,{"$f":"IF(ISBLANK(E26 ),\"\",IF( VLOOKUP(E26,Scales!$C$3:$D$19,2,FALSE) <0, \"\", D26*VLOOKUP(E26,Scales!$C$3:$D$19,2,FALSE)))","v":""}]
["D","INMS-A 390","Art, Aesthetics and Creativity (VT: The Artist and New Media)",3,null,null,null,"REQUIRED",0,0,{"$f":"IF(ISBLANK(E27 ),\"\",IF( VLOOKUP(E27,Scales!$C$3:$D$19,2,FALSE) <0, \"\", D27*VLOOKUP(E27,Scales!$C$3:$D$19,2,FALSE)))","v":""}]
[]
["CONTEMPORARY SOCIAL VALUES (9 Credits)"]
["https://academics.iusb.edu/general-education/contemporary-social-values.html "]
[null,"Course No.","Title","Credit","Grade","Semester","Year","Notes:","Hrs Psd","GPA Hrs","GPA"]
["A",null,"Non-Western Cultures",3,null,null,null,"(e.g., ANTH E105, POLS Y109)",{"$f":"IF(OR(E32= \"A+\",E32=\"A\", E32=\"A-\",E32=\"B+\", E32=\"B\", E32=\"B-\", E32=\"C+\", E32=\"C\", E32=\"C-\", E32=\"D+\", E32=\"D\", E32=\"D-\", E32=\"S\"), D32, 0)","v":0},{"$f":"IF(OR(E32= \"A+\",E32=\"A\", E32=\"A-\",E32=\"B+\", E32=\"B\", E32=\"B-\", E32=\"C+\", E32=\"C\", E32=\"C-\", E32=\"D+\", E32=\"D\", E32=\"D-\", E32=\"F\"), D32, 0)","v":0},{"$f":"IF(ISBLANK(E32 ),\"\",IF( VLOOKUP(E32,Scales!$C$3:$D$19,2,FALSE) <0, \"\", D32*VLOOKUP(E32,Scales!$C$3:$D$19,2,FALSE)))","v":""}]
["B",null,"Diversity in U.S. Society",3,null,null,null,"(e.g., SOC S161, HIST-H 106)",{"$f":"IF(OR(E33= \"A+\",E33=\"A\", E33=\"A-\",E33=\"B+\", E33=\"B\", E33=\"B-\", E33=\"C+\", E33=\"C\", E33=\"C-\", E33=\"D+\", E33=\"D\", E33=\"D-\", E33=\"S\"), D33, 0)","v":0},{"$f":"IF(OR(E33= \"A+\",E33=\"A\", E33=\"A-\",E33=\"B+\", E33=\"B\", E33=\"B-\", E33=\"C+\", E33=\"C\", E33=\"C-\", E33=\"D+\", E33=\"D\", E33=\"D-\", E33=\"F\"), D33, 0)","v":0},{"$f":"IF(ISBLANK(E33 ),\"\",IF( VLOOKUP(E33,Scales!$C$3:$D$19,2,FALSE) <0, \"\", D33*VLOOKUP(E33,Scales!$C$3:$D$19,2,FALSE)))","v":""}]
["C",null,"Health and Wellness",3,null,null,null,"(e.g., HPER N220, NURS B109 plus HPER-E100-level)",{"$f":"IF(OR(E34= \"A+\",E34=\"A\", E34=\"A-\",E34=\"B+\", E34=\"B\", E34=\"B-\", E34=\"C+\", E34=\"C\", E34=\"C-\", E34=\"D+\", E34=\"D\", E34=\"D-\", E34=\"S\"), D34, 0)","v":0},{"$f":"IF(OR(E34= \"A+\",E34=\"A\", E34=\"A-\",E34=\"B+\", E34=\"B\", E34=\"B-\", E34=\"C+\", E34=\"C\", E34=\"C-\", E34=\"D+\", E34=\"D\", E34=\"D-\", E34=\"F\"), D34, 0)","v":0},{"$f":"IF(ISBLANK(E34 ),\"\",IF( VLOOKUP(E34,Scales!$C$3:$D$19,2,FALSE) <0, \"\", D34*VLOOKUP(E34,Scales!$C$3:$D$19,2,FALSE)))","v":""}]
["D",null,null,null,null,null,null,null,{"$f":"IF(OR(E35= \"A+\",E35=\"A\", E35=\"A-\",E35=\"B+\", E35=\"B\", E35=\"B-\", E35=\"C+\", E35=\"C\", E35=\"C-\", E35=\"D+\", E35=\"D\", E35=\"D-\", E35=\"S\"), D35, 0)","v":0},{"$f":"IF(OR(E35= \"A+\",E35=\"A\", E35=\"A-\",E35=\"B+\", E35=\"B\", E35=\"B-\", E35=\"C+\", E35=\"C\", E35=\"C-\", E35=\"D+\", E35=\"D\", E35=\"D-\", E35=\"F\"), D35, 0)","v":0},{"$f":"IF(ISBLANK(E35 ),\"\",IF( VLOOKUP(E35,Scales!$C$3:$D$19,2,FALSE) <0, \"\", D35*VLOOKUP(E35,Scales!$C$3:$D$19,2,FALSE)))","v":""}]
[]
["LANGUAGE STUDIES (12 Credits)"]
["https://bulletins.iu.edu/iusb/2019-2020/schools/college-of-liberal-arts-and-sciences/world-languages/index.shtml"]
["If you are native speaker of another language complete the following form and submit to the college for potentially waiving your language requirements. https://clas.iusb.edu/docs/WorldLanguageProficiency_2019.pdf "]
[null,"Course No.","Title","Credit","Grade","Semester","Year","Notes:","Hrs Psd","GPA Hrs","GPA"]
["A",null,null,3,null,null,null,"Four semesters in a single language (3 to 12 credits depending on placement exam)",{"$f":"IF(OR(E41= \"A+\",E41=\"A\", E41=\"A-\",E41=\"B+\", E41=\"B\", E41=\"B-\", E41=\"C+\", E41=\"C\", E41=\"C-\", E41=\"D+\", E41=\"D\", E41=\"D-\", E41=\"S\"), D41, 0)","v":0},{"$f":"IF(OR(E41= \"A+\",E41=\"A\", E41=\"A-\",E41=\"B+\", E41=\"B\", E41=\"B-\", E41=\"C+\", E41=\"C\", E41=\"C-\", E41=\"D+\", E41=\"D\", E41=\"D-\", E41=\"F\"), D41, 0)","v":0},{"$f":"IF(ISBLANK(E41 ),\"\",IF( VLOOKUP(E41,Scales!$C$3:$D$19,2,FALSE) <0, \"\", D41*VLOOKUP(E41,Scales!$C$3:$D$19,2,FALSE)))","v":""}]
["B",null,null,3,null,null,null,"Completion of fourth semester language class or one course at 300 or 400-level. (IUSB offers Japanese, French, German, and Spanish.)"]
["C",null,null,3]
["D",null,null,3,null,null,null,null,{"$f":"IF(OR(E44= \"A+\",E44=\"A\", E44=\"A-\",E44=\"B+\", E44=\"B\", E44=\"B-\", E44=\"C+\", E44=\"C\", E44=\"C-\", E44=\"D+\", E44=\"D\", E44=\"D-\", E44=\"S\"), D44, 0)","v":0},{"$f":"IF(OR(E44= \"A+\",E44=\"A\", E44=\"A-\",E44=\"B+\", E44=\"B\", E44=\"B-\", E44=\"C+\", E44=\"C\", E44=\"C-\", E44=\"D+\", E44=\"D\", E44=\"D-\", E44=\"F\"), D44, 0)","v":0},{"$f":"IF(ISBLANK(E44 ),\"\",IF( VLOOKUP(E44,Scales!$C$3:$D$19,2,FALSE) <0, \"\", D44*VLOOKUP(E44,Scales!$C$3:$D$19,2,FALSE)))","v":""}]
[]
["PHYSICAL & LIFE SCIENCES (5 Credits)"]
[null,"Course No.","Title","Credit","Grade","Semester","Year","Notes:","Hrs Psd","GPA Hrs","GPA"]
["A",null,"Science Course & Laboratory",5,null,null,null,"This requirement may be met with one of the following options: 1) An integrated lecture lab course totaling 5 credits; 2) An additional N190, N390, or other natural science course linked to a lab (2 credit);   Natural Sciences include: ANAT, AST, CHEM, BIOL, GEOL, MICR, PHSL, PHYS, PLSC",{"$f":"IF(OR(E48= \"A+\",E48=\"A\", E48=\"A-\",E48=\"B+\", E48=\"B\", E48=\"B-\", E48=\"C+\", E48=\"C\", E48=\"C-\", E48=\"D+\", E48=\"D\", E48=\"D-\", E48=\"S\"), D48, 0)","v":0},{"$f":"IF(OR(E48= \"A+\",E48=\"A\", E48=\"A-\",E48=\"B+\", E48=\"B\", E48=\"B-\", E48=\"C+\", E48=\"C\", E48=\"C-\", E48=\"D+\", E48=\"D\", E48=\"D-\", E48=\"F\"), D48, 0)","v":0},{"$f":"IF(ISBLANK(E48 ),\"\",IF( VLOOKUP(E48,Scales!$C$3:$D$19,2,FALSE) <0, \"\", D48*VLOOKUP(E48,Scales!$C$3:$D$19,2,FALSE)))","v":""}]
[]
["Junior/Senior-Level Writing (3 Credits) (requires 'C' (2.0) or higher)"]
["https://bulletins.iu.edu/iusb/2019-2020/schools/college-of-liberal-arts-and-sciences/jr-sr-level-writing.shtml"]
[null,"Course No.","Title","Credit","Grade","Semester","Year","Notes:","Hrs Psd","GPA Hrs","GPA"]
["A",null,"Junior/Senior-Level Writing",3,null,null,null,null,{"$f":"IF(OR(E53= \"A+\",E53=\"A\", E53=\"A-\",E53=\"B+\", E53=\"B\", E53=\"B-\", E53=\"C+\", E53=\"C\", E53=\"C-\", E53=\"D+\", E53=\"D\", E53=\"D-\", E53=\"S\"), D53, 0)","v":0},{"$f":"IF(OR(E53= \"A+\",E53=\"A\", E53=\"A-\",E53=\"B+\", E53=\"B\", E53=\"B-\", E53=\"C+\", E53=\"C\", E53=\"C-\", E53=\"D+\", E53=\"D\", E53=\"D-\", E53=\"F\"), D53, 0)","v":0},{"$f":"IF(ISBLANK(E53 ),\"\",IF( VLOOKUP(E53,Scales!$C$3:$D$19,2,FALSE) <0, \"\", D53*VLOOKUP(E53,Scales!$C$3:$D$19,2,FALSE)))","v":""}]
[]
["Western Culture Before 1800"]
["https://bulletins.iu.edu/iusb/2019-2020/schools/college-of-liberal-arts-and-sciences/western-culture.shtml"]
[null,"Course No.","Title","Credit","Grade","Semester","Year","Notes:","Hrs Psd","GPA Hrs","GPA"]
["A",null,"WesternCulture Before 1800",3,null,null,null,null,{"$f":"IF(OR(E58= \"A+\",E58=\"A\", E58=\"A-\",E58=\"B+\", E58=\"B\", E58=\"B-\", E58=\"C+\", E58=\"C\", E58=\"C-\", E58=\"D+\", E58=\"D\", E58=\"D-\", E58=\"S\"), D58, 0)","v":0},{"$f":"IF(OR(E58= \"A+\",E58=\"A\", E58=\"A-\",E58=\"B+\", E58=\"B\", E58=\"B-\", E58=\"C+\", E58=\"C\", E58=\"C-\", E58=\"D+\", E58=\"D\", E58=\"D-\", E58=\"F\"), D58, 0)","v":0},{"$f":"IF(ISBLANK(E58 ),\"\",IF( VLOOKUP(E58,Scales!$C$3:$D$19,2,FALSE) <0, \"\", D58*VLOOKUP(E58,Scales!$C$3:$D$19,2,FALSE)))","v":""}]
[]
["QUANTITATIVE AND ANALYTICAL SKILLS (3 Credits) (A grade of C or better is required)"]
[null,"Course No.","Title","Credit","Grade","Semester","Year","Notes:","Hrs Psd","GPA Hrs","GPA"]
["A","MATH M118","Finite Mathematics",3,null,null,null,"(Grade of C or better)",{"$f":"IF(OR(E62= \"A+\",E62=\"A\", E62=\"A-\",E62=\"B+\", E62=\"B\", E62=\"B-\", E62=\"C+\", E62=\"C\", E62=\"C-\", E62=\"D+\", E62=\"D\", E62=\"D-\", E62=\"S\"), D62, 0)","v":0},{"$f":"IF(OR(E62= \"A+\",E62=\"A\", E62=\"A-\",E62=\"B+\", E62=\"B\", E62=\"B-\", E62=\"C+\", E62=\"C\", E62=\"C-\", E62=\"D+\", E62=\"D\", E62=\"D-\", E62=\"F\"), D62, 0)","v":0},{"$f":"IF(ISBLANK(E62 ),\"\",IF( VLOOKUP(E62,Scales!$C$3:$D$19,2,FALSE) <0, \"\", D62*VLOOKUP(E62,Scales!$C$3:$D$19,2,FALSE)))","v":""}]
[]
["INFORMATICS FOUNDATIONS (19 Credits)  (A grade of C- or better is required) (Overall GPA of 2.0 in major courses is required)"]
[null,"Course No.","Title","Credit","Grade","Semester","Year","Notes:","Hrs Psd","GPA Hrs","GPA"]
["A","INFO-I 101","Introduction to Informatics",4,null,null,null,"or B100",{"$f":"IF(OR(E66= \"A+\",E66=\"A\", E66=\"A-\",E66=\"B+\", E66=\"B\", E66=\"B-\", E66=\"C+\", E66=\"C\", E66=\"C-\", E66=\"D+\", E66=\"D\", E66=\"D-\", E66=\"S\"), D66, 0)","v":0},{"$f":"IF(OR(E66= \"A+\",E66=\"A\", E66=\"A-\",E66=\"B+\", E66=\"B\", E66=\"B-\", E66=\"C+\", E66=\"C\", E66=\"C-\", E66=\"D+\", E66=\"D\", E66=\"D-\", E66=\"F\"), D66, 0)","v":0},{"$f":"IF(ISBLANK(E66 ),\"\",IF( VLOOKUP(E66,Scales!$C$3:$D$19,2,FALSE) <0, \"\", D66*VLOOKUP(E66,Scales!$C$3:$D$19,2,FALSE)))","v":""}]
["B","INFO-I 201 ","Math. Found. of Informatics",4,null,null,null,null,{"$f":"IF(OR(E67= \"A+\",E67=\"A\", E67=\"A-\",E67=\"B+\", E67=\"B\", E67=\"B-\", E67=\"C+\", E67=\"C\", E67=\"C-\", E67=\"D+\", E67=\"D\", E67=\"D-\", E67=\"S\"), D67, 0)","v":0},{"$f":"IF(OR(E67= \"A+\",E67=\"A\", E67=\"A-\",E67=\"B+\", E67=\"B\", E67=\"B-\", E67=\"C+\", E67=\"C\", E67=\"C-\", E67=\"D+\", E67=\"D\", E67=\"D-\", E67=\"F\"), D67, 0)","v":0},{"$f":"IF(ISBLANK(E67 ),\"\",IF( VLOOKUP(E67,Scales!$C$3:$D$19,2,FALSE) <0, \"\", D67*VLOOKUP(E67,Scales!$C$3:$D$19,2,FALSE)))","v":""}]
["D","INFO-I 210 ","Information Infrastructure I",4,null,null,null,"or CSCI-C 101 ",0,0,{"$f":"IF(ISBLANK(E68 ),\"\",IF( VLOOKUP(E68,Scales!$C$3:$D$19,2,FALSE) <0, \"\", D68*VLOOKUP(E68,Scales!$C$3:$D$19,2,FALSE)))","v":""}]
["E","INFO-I 211","Information Infrastructure II",4,null,null,null,"or CSCI-C 201 ",0,0,{"$f":"IF(ISBLANK(E69 ),\"\",IF( VLOOKUP(E69,Scales!$C$3:$D$19,2,FALSE) <0, \"\", D69*VLOOKUP(E69,Scales!$C$3:$D$19,2,FALSE)))","v":""}]
["F","INFO-I 310","Multimedia Arts and Tech",3,null,null,null,null,0,0,{"$f":"IF(ISBLANK(E70 ),\"\",IF( VLOOKUP(E70,Scales!$C$3:$D$19,2,FALSE) <0, \"\",#REF!*VLOOKUP( E70,Scales!$C$3:$D$19,2,FALSE)))","v":""}]
["INFORMATICS ELECTIVES (3 cr. Choose one course)"]
["E",null,null,3,null,null,null,null,0,0,{"$f":"IF(ISBLANK(E72 ),\"\",IF( VLOOKUP(E72,Scales!$C$3:$D$19,2,FALSE) <0, \"\", D72*VLOOKUP(E72,Scales!$C$3:$D$19,2,FALSE)))","v":""}]
[]
["NEW MEDIA FOUNDATION (15 Credits) (A grade of C- or better is required) (Overall GPA of 2.0 in major courses is required)"]
[null,"Course No.","Title","Credit","Grade","Semester","Year","Notes:","Hrs Psd","GPA Hrs","GPA"]
["A","INMS-N 111","New Media Composition and Aesthetics I",3,null,null,null,null,{"$f":"IF(OR(E76= \"A+\",E76=\"A\", E76=\"A-\",E76=\"B+\", E76=\"B\", E76=\"B-\", E76=\"C+\", E76=\"C\", E76=\"C-\", E76=\"D+\", E76=\"D\", E76=\"D-\", E76=\"S\"), D76, 0)","v":0},{"$f":"IF(OR(E76= \"A+\",E76=\"A\", E76=\"A-\",E76=\"B+\", E76=\"B\", E76=\"B-\", E76=\"C+\", E76=\"C\", E76=\"C-\", E76=\"D+\", E76=\"D\", E76=\"D-\", E76=\"F\"), D76, 0)","v":0},{"$f":"IF(ISBLANK(E76 ),\"\",IF( VLOOKUP(E76,Scales!$C$3:$D$19,2,FALSE) <0, \"\", D76*VLOOKUP(E76,Scales!$C$3:$D$19,2,FALSE)))","v":""}]
["B","INMS-N 112","New Media Composition and Aesthetics II",3,null,null,null,null,{"$f":"IF(OR(E77= \"A+\",E77=\"A\", E77=\"A-\",E77=\"B+\", E77=\"B\", E77=\"B-\", E77=\"C+\", E77=\"C\", E77=\"C-\", E77=\"D+\", E77=\"D\", E77=\"D-\", E77=\"S\"), D77, 0)","v":0},{"$f":"IF(OR(E77= \"A+\",E77=\"A\", E77=\"A-\",E77=\"B+\", E77=\"B\", E77=\"B-\", E77=\"C+\", E77=\"C\", E77=\"C-\", E77=\"D+\", E77=\"D\", E77=\"D-\", E77=\"F\"), D77, 0)","v":0},{"$f":"IF(ISBLANK(E77 ),\"\",IF( VLOOKUP(E77,Scales!$C$3:$D$19,2,FALSE) <0, \"\", D77*VLOOKUP(E77,Scales!$C$3:$D$19,2,FALSE)))","v":""}]
["D","INMS-N 201","Digital 3D Art and Design I",3,null,null,null,null,0,0,{"$f":"IF(ISBLANK(E78 ),\"\",IF( VLOOKUP(E78,Scales!$C$3:$D$19,2,FALSE) <0, \"\", D78*VLOOKUP(E78,Scales!$C$3:$D$19,2,FALSE)))","v":""}]
["E","INMS-N 283","Intro. Production Tech and Prac.",3,null,null,null,null,0,0,{"$f":"IF(ISBLANK(E79 ),\"\",IF( VLOOKUP(E79,Scales!$C$3:$D$19,2,FALSE) <0, \"\", D79*VLOOKUP(E79,Scales!$C$3:$D$19,2,FALSE)))","v":""}]
["F","INMS-N 325","Multimodal Design",3,null,null,null,null,0,0,{"$f":"IF(ISBLANK(E80 ),\"\",IF( VLOOKUP(E80,Scales!$C$3:$D$19,2,FALSE) <0, \"\",#REF!*VLOOKUP( E80,Scales!$C$3:$D$19,2,FALSE)))","v":""}]
{"$rows_left_out":31}
{"sheet":"Scales","index":1,"n_rows":19,"n_cols":4,"rows_kept":19,"cut":false,"hidden":false,"merged":[]}
[]
["Semesters","Years","Grade","Points"]
[null,null,"A+",4]
["Fall",2003,"A",4]
["Spring",2004,"A-",3.7]
["Sum I",2005,"B+",3.3]
["Sum II",2006,"B",3]
[null,2007,"B-",2.7]
[null,2010,"C+",2.2999999999999998]
[null,null,"C",2]
[null,null,"C-",1.7]
[null,null,"D+",1.3]
[null,null,"D",1]
[null,null,"D-",0.7]
[null,null,"F",0]
[null,null,"I",-1]
[null,null,"S",-2]
[null,null,".",-3]
[null,null,"-",-4]

{"sheet":"CourseOptions","index":2,"n_rows":81,"n_cols":3,"rows_kept":81,"cut":false,"hidden":false,"merged":[]}
["Stat Classes:","MATH M365"]
[null,"SOC-S 351"]
[null,"MATH-K 300"]
[null,"MATH-K 310"]
[null,"PSY-K 300"]
[null,"PSY-K 310"]
[]
[]
[]
["Informatics Electives:","INFO-I 202 Social Informatics"]
[null,"INFO-I 213 Website Design and Development"]
[null,"INFO-I 300 Human Computer Interaction"]
[null,"INFO-I 400 Mobile App. Dev."]
[null,"CSCI-C 481 Computer Graphics"]
[null,"INFO-I 400 Embedded Systems"]
[null,"Additional INFO or CS course with the chair's approval"]
[]
[]
[]
["New Media Electives:","INMS-N 308 Integrated New Media Studies Internship"]
[null,"TEL-T 336 Digital Video Production"]
[null,"INMS-N 369 Interactive Multimedia"]
[null,"INMS-N 427 Advanced Integrated New Media Workshop"]
[null,"INMS-N 430 Topical Seminar in New Media"]
[null,"INMS-N 497 Independent Study in New Media"]
[null,"TEL-T 498 Projects in Telecommunications"]
[null,"Any other course from a concentration different from the chosen one"]
[null,"Other New Media 300 or 400 level course with the chair’s approval"]
[]
[]
["Semesters:","Fall"]
[null,"Spring"]
[null,"Summer"]
[]
[]
["• Concentration (Choose one) (18 cr.)"]
["Game"]
[null,"INMS-N 212","Game Design 1"]
[null,"INMS-N 313","Game Design 2"]
[null,"INMS-N 414","Game Design 3"]
[null,"INFO Game Programming 1"]
[null,"INFO Game Programming 2"]
[null,"INFO Game Programming 3"]
["Web"]
[null,"INMS-N 442","Integrated Web Design 1"]
[null,"INMS-N 443","Integrated Web Design 2"]
[null,"INMS-N 444","Integrated Web Design 3"]
[null,"INFO Web Programming 1"]
[null,"INFO Web Programming 2"]
[null,"INFO Web Programming 3"]
["Video"]
[null,"INMS-N 300","Video Art"]
[null,"INMS-N 337","Adv. Motion Graphics & Composition"]
[null,"TEL-T 336","Digital Video Production"]
[null,"CSCI-C 481","Computer Graphics"]
[null,"INFO-I 300","Human Computer Interaction"]
[null,"INFO/CSCI Multimedia Web Programming"]
[]
["3D"]
[null,"INMS-N 302","Digital 3D Art and Design 2"]
[null,"INMS-N 303","Digital 3D Art and Design 3"]
[null,"INMS-N 337","Advanced Motion Graphics"]
[null,"INFO/CSCI Game Programming 1"]
[null,"INFO/CSCI Game Programming 2"]
[null,"CSCI-C 481","Computer Graphics"]
[]
["Individualized (in consultation with INMS/INFO academic advisor)"]
[null,"3 Design Courses from the Concentrations"]
[null,"3 Programming Courses from the Concentrations"]
[]
[]
[]
[]
[]
[]
[]
["Concentrations:","GAME"]
[null,"WEB"]
[null,"VIDEO"]
[null,"3D"]
{"$rows_left_out":2}
{"sheet":"Additional Items to Consider","index":3,"n_rows":12,"n_cols":3,"rows_kept":12,"cut":false,"hidden":false,"merged":[]}
["Additional items to consider:"]
[1,"Bring your laptop to every advising meeting"]
[2,"Honors program","https://academics.iusb.edu/honors-program/index.html"]
[3,"Career Services/Internship/Resume","https://students.iusb.edu/career-services/index.html"]
[4,"iGPS Degree Map","https://igps.iu.edu/sisaadm-prd/?casticket=ST-190052-YQdbKfygb67U1frqQQxecasprd04"]
[5,"iGPS Plan (Students)","https://one.iu.edu/task/iu/igps-plan"]
[6,"Campus Bulletin","https://bulletin.iu.edu/iusb/2019-2020/"]
[7,"Graduation Application","https://clas.iusb.edu/students/grad-application/index.html"]
[8,"General Education (Petition for Subsitution/Exemption)","https://academics.iusb.edu/general-education/student-petitions.html"]
[9,"Golden Ticket (For advising appointment)","https://clas.iusb.edu/docs/Advising%20appointment%20form.pdf"]
[10,"Student Center","https://one.iu.edu/launch-task/iu/student-center?terms=student%20center"]
[11,"Student Clubs","https://titanatlas.iusb.edu/organizations"]